Target
Probable G-protein coupled receptor 142
Ligand
BDBM50440706
Substrate
Meas. Tech.
ChEMBL_985959 (CHEMBL2432191)
EC50
502±n/a nM
Citation
 Yu, MLizarzaburu, MMotani, AFu, ZDu, XLiu, JJJiao, XLai, SFan, PFu, ALiu, QMurakoshi, MNara, FOda, KOkuyama, RReagan, JDWatanabe, NYamazaki, MXiong, YZhang, YZhuang, RLin, DCHouze, JBMedina, JCLi, L Aminopyrazole-Phenylalanine Based GPR142 Agonists: Discovery of Tool Compound and in Vivo Efficacy Studies. ACS Med Chem Lett 4:829-34 (2013)  
Target
Name:
Probable G-protein coupled receptor 142
Synonyms:
G-protein coupled receptor PGR2 GPR142 | PGR2
Type:
PROTEIN
Mol. Mass.:
51127.50
Organism:
Homo sapiens (Human)
Description:
ChEMBL_985961
Residue:
462
  
Inhibitor
Name:
BDBM50440706
Synonyms:
CHEMBL2431066
Type:
Small organic molecule
Emp. Form.:
C23H21N5O2S
Mol. Mass.:
431.51
SMILES:
O=C(Nc1cc(c[nH]c1=O)-c1ccncc1)[C@H](Cc1ccccc1)NCc1cncs1
: