Target
Nitric oxide synthase, inducible
Ligand
BDBM50441055
Substrate
Meas. Tech.
ChEMBL_985785 (CHEMBL2434147)
IC50
32000±n/a nM
Citation
 Andreani, ALeoni, ALocatelli, AMorigi, RRambaldi, MCervellati, RGreco, EKondratyuk, TPPark, EJHuang, Kvan Breemen, RBPezzuto, JM Chemopreventive and antioxidant activity of 6-substituted imidazo[2,1-b]thiazoles. Eur J Med Chem 68:412-21 (2013)  
Target
Name:
Nitric oxide synthase, inducible
Synonyms:
Inducible NO synthase Inducible nitric oxide synthase (iNOS) MAC-NOS NOS type II Nitric Oxide Synthase, inducible Nos2
Type:
Enzyme
Mol. Mass.:
130595.79
Organism:
Mus musculus (mouse)
Description:
Recombinant enzyme overexpressed in E. coli.
Residue:
1144
  
Inhibitor
Name:
BDBM50441055
Synonyms:
CHEMBL1744478
Type:
Small organic molecule
Emp. Form.:
C7H16N4O2
Mol. Mass.:
188.2275
SMILES:
CNC(=N)NCCC[C@H](N)C(O)=O
: