Target
Aromatase
Ligand
BDBM50441057
Substrate
Meas. Tech.
ChEMBL_985778 (CHEMBL2433995)
IC50
3200±n/a nM
Citation
 Andreani, ALeoni, ALocatelli, AMorigi, RRambaldi, MCervellati, RGreco, EKondratyuk, TPPark, EJHuang, Kvan Breemen, RBPezzuto, JM Chemopreventive and antioxidant activity of 6-substituted imidazo[2,1-b]thiazoles. Eur J Med Chem 68:412-21 (2013)  
Target
Name:
Aromatase
Synonyms:
ARO1 CP19A_HUMAN CYP19 CYPXIX Cytochrome P450 19A1 Cytochrome P450-C19 (CYP19) FL cytokine receptor precursor | P-450AROM
Type:
Enzyme
Mol. Mass.:
57888.92
Organism:
Homo sapiens (Human)
Description:
P11511
Residue:
503
  
Inhibitor
Name:
BDBM50441057
Synonyms:
CHEMBL2430197
Type:
Small organic molecule
Emp. Form.:
C12H10N2O3S
Mol. Mass.:
262.284
SMILES:
Cc1cn2cc(nc2s1)-c1ccc(O)c(O)c1O
: