Target
Poly [ADP-ribose] polymerase 2
Ligand
BDBM50441357
Substrate
Meas. Tech.
ChEMBL_984399 (CHEMBL2433123)
IC50
479±n/a nM
Citation
 Narwal, MKoivunen, JHaikarainen, TObaji, ELegala, OEVenkannagari, HJoensuu, PPihlajaniemi, TLehtiö, L Discovery of tankyrase inhibiting flavones with increased potency and isoenzyme selectivity. J Med Chem 56:7880-9 (2013)  
Target
Name:
Poly [ADP-ribose] polymerase 2
Synonyms:
(ARTD2 or PARP2) ADPRTL2 PARP2_HUMAN Poly [ADP-ribose] polymerase 2 (PARP2)
Type:
Enzyme
Mol. Mass.:
66225.70
Organism:
Homo sapiens (Human)
Description:
Q9UGN5
Residue:
583
  
Inhibitor
Name:
BDBM50441357
Synonyms:
CHEMBL2431805
Type:
Small organic molecule
Emp. Form.:
C14H11F3N2OS
Mol. Mass.:
312.31
SMILES:
FC(F)(F)c1ccc(cc1)-c1nc2CSCCc2c(=O)[nH]1
: