Target
Mitogen-activated protein kinase kinase kinase 2
Ligand
BDBM50441567
Substrate
Meas. Tech.
ChEMBL_988905 (CHEMBL2439759)
IC50
661±n/a nM
Citation
 Goodfellow, VSLoweth, CJRavula, SBWiemann, TNguyen, TXu, YTodd, DESheppard, DPollack, SPolesskaya, OMarker, DFDewhurst, SGelbard, HA Discovery, synthesis, and characterization of an orally bioavailable, brain penetrant inhibitor of mixed lineage kinase 3. J Med Chem 56:8032-48 (2013)  
Target
Name:
Mitogen-activated protein kinase kinase kinase 2
Synonyms:
M3K2_HUMAN MAPK/ERK kinase kinase 2 MEK kinase 2 MEKK2
Type:
PROTEIN
Mol. Mass.:
69751.14
Organism:
Homo sapiens (Human)
Description:
ChEMBL_1473904
Residue:
619
  
Inhibitor
Name:
BDBM50441567
Synonyms:
CHEMBL2436978 | US10485800, Example 181
Type:
Small organic molecule
Emp. Form.:
C27H27N5
Mol. Mass.:
421.5368
SMILES:
CN1CCN(Cc2ccc(cc2)-c2cnc3[nH]cc(-c4ccc5[nH]ccc5c4)c3c2)CC1
: