Target
A disintegrin and metalloproteinase with thrombospondin motifs 5
Ligand
BDBM50441603
Substrate
Meas. Tech.
ChEMBL_986810 (CHEMBL2438451)
IC50
12600±n/a nM
Citation
 Maingot, LElbakali, JDumont, JBosc, DCousaert, NUrban, ADeglane, GVilloutreix, BNagase, HSperandio, OLeroux, FDeprez, BDeprez-Poulain, R Aggrecanase-2 inhibitors based on the acylthiosemicarbazide zinc-binding group. Eur J Med Chem 69:244-61 (2013)  
Target
Name:
A disintegrin and metalloproteinase with thrombospondin motifs 5
Synonyms:
A disintegrin and metalloproteinase with thrombospondin motifs 5 (ADAMTS-5) ADAMTS5 ATS5_HUMAN Metalloproteinase with thrombospondin motifs 5 (ADAMTS-5)
Type:
Enzyme
Mol. Mass.:
101769.09
Organism:
Homo sapiens (Human)
Description:
Q9UNA0
Residue:
930
  
Inhibitor
Name:
BDBM50441603
Synonyms:
CHEMBL1422461
Type:
Small organic molecule
Emp. Form.:
C16H16ClN3O2S
Mol. Mass.:
349.835
SMILES:
Clc1ccc(OCC(=O)NNC(=S)NCc2ccccc2)cc1
: