Target
Histamine H3 receptor
Ligand
BDBM50441642
Substrate
Meas. Tech.
ChEMBL_986995 (CHEMBL2439315)
Kd
2.0±n/a nM
Citation
 Zeng, QRosenblum, SBYang, ZJiang, YMcCormick, KDAslanian, RGDuguma, LKozlowski, JAShih, NYHey, JAWest, REKorfmacher, WABerlin, MBoyce, CW Synthesis and SAR studies of benzimidazolone derivatives as histamine H3-receptor antagonists. Bioorg Med Chem Lett 23:6001-3 (2013)  
Target
Name:
Histamine H3 receptor
Synonyms:
HISTAMINE H3 HRH3_CAVPO | Histamine H3 receptor
Type:
Enzyme Catalytic Domain
Mol. Mass.:
48753.61
Organism:
GUINEA PIG
Description:
HISTAMINE H3 HRH3 GUINEA PIG::Q9JI35
Residue:
445
  
Inhibitor
Name:
BDBM50441642
Synonyms:
CHEMBL2437425
Type:
Small organic molecule
Emp. Form.:
C26H30F4N6O2
Mol. Mass.:
534.549
SMILES:
Nc1cc(CN2CCC(CC2)C(=O)N2CCC(CC2)n2c3ccc(F)cc3n(CC(F)(F)F)c2=O)ccn1
: