Target
Papain
Ligand
BDBM50441681
Substrate
Meas. Tech.
ChEMBL_988143 (CHEMBL2439234)
IC50
>10000±n/a nM
Citation
 Ribeiro, CJKumar, SPGut, JGonçalves, LMRosenthal, PJMoreira, RSantos, MM Squaric acid/4-aminoquinoline conjugates: novel potent antiplasmodial agents. Eur J Med Chem 69:365-72 (2013)  
Target
Name:
Papain
Synonyms:
Allergen=Car p 1 PPI | Papaya proteinase I
Type:
Enzyme
Mol. Mass.:
38923.01
Organism:
Carica papaya
Description:
Papain was purchased from Sigma, Germany.
Residue:
345
  
Inhibitor
Name:
BDBM50441681
Synonyms:
CHEMBL2435697
Type:
Small organic molecule
Emp. Form.:
C20H22ClN3O3
Mol. Mass.:
387.86
SMILES:
CCCCOc1c(NCCCNc2ccnc3cc(Cl)ccc23)c(=O)c1=O
: