Target
Tyrosine-protein phosphatase non-receptor type 1
Ligand
BDBM50441788
Substrate
Meas. Tech.
ChEMBL_988373 (CHEMBL2437800)
IC50
5560±n/a nM
Citation
 Chen, YTTang, CLMa, WPGao, LXWei, YZhang, WLi, JYLi, JNan, FJ Design, synthesis, and biological evaluation of novel 2-ethyl-5-phenylthiazole-4-carboxamide derivatives as protein tyrosine phosphatase 1B inhibitors with improved cellular efficacy. Eur J Med Chem 69:399-412 (2013)  
Target
Name:
Tyrosine-protein phosphatase non-receptor type 1
Synonyms:
PTN1_HUMAN PTPN1 Protein tyrosine phosphatase-1B (PTP1B) Protein-tyrosine phosphatase 1B (PTP1B) Tyrosine-protein phosphatase non-receptor type 1 (PTP1B)
Type:
Protein phosphatase
Mol. Mass.:
49963.76
Organism:
Homo sapiens (Human)
Description:
Human recombinant GST-fusion PTP1B (1-435).
Residue:
435
  
Inhibitor
Name:
BDBM50441788
Synonyms:
CHEMBL2436033
Type:
Small organic molecule
Emp. Form.:
C43H36N4O5S
Mol. Mass.:
720.835
SMILES:
OC(=O)c1ccccc1NC(=O)c1nc(sc1-c1ccccc1)[C@H](Cc1ccc(OCc2ccccc2)cc1)NC(=O)CCc1c[nH]c2ccccc12
: