Target
Induced myeloid leukemia cell differentiation protein Mcl-1
Ligand
BDBM50441889
Substrate
Meas. Tech.
ChEMBL_987265 (CHEMBL2437894)
Ki
123±n/a nM
Citation
 Zhang, ZLiang, XLi, XSong, TChen, QSheng, H Design and application of a rigid quinazolone scaffold based on two-face Bima-helix mimicking. Eur J Med Chem 69:711-8 (2013)  
Target
Name:
Induced myeloid leukemia cell differentiation protein Mcl-1
Synonyms:
BCL2L3 Bcl-2-like protein 3 (Mcl-1) Bcl2-L-3 MCL1 Mcl-1 Myeloid cell leukemia sequence 1 (BCL2-related) | mcl1/EAT
Type:
Membrane; Single-pass membrane protein
Mol. Mass.:
37332.87
Organism:
Homo sapiens (Human)
Description:
Q07820
Residue:
350
  
Inhibitor
Name:
BDBM50441889
Synonyms:
CHEMBL2436891
Type:
Small organic molecule
Emp. Form.:
C22H18N2O5
Mol. Mass.:
390.3887
SMILES:
Cc1ccc(O)c(Cn2c(nc3c(O)c(O)c(O)cc3c2=O)-c2ccccc2)c1
: