Target
Leukotriene A-4 hydrolase
Ligand
BDBM50441919
Substrate
Meas. Tech.
ChEMBL_987635 (CHEMBL2439368)
Ki
8650±n/a nM
Citation
 Ali, AREl-Bendary, ERGhaly, MAShehata, IA Novel acetamidothiazole derivatives: synthesis and in vitro anticancer evaluation. Eur J Med Chem 69:908-19 (2013)  
Target
Name:
Leukotriene A-4 hydrolase
Synonyms:
LKHA4_HUMAN LTA4 Leukotriene A(4) hydrolase Leukotriene A4 hydrolase
Type:
Hydrolase; metalloprotease
Mol. Mass.:
69280.41
Organism:
Homo sapiens (Human)
Description:
Human recombinant LTA4H.
Residue:
611
  
Inhibitor
Name:
BDBM50441919
Synonyms:
CHEMBL2437301
Type:
Small organic molecule
Emp. Form.:
C15H17N3O2S
Mol. Mass.:
303.379
SMILES:
N=c1scc(-c2ccccc2)n1CC(=O)N1CCOCC1
: