Target
Cytohesin-2
Ligand
BDBM50441973
Substrate
Meas. Tech.
ChEMBL_992400 (CHEMBL2445620)
Ki
1610000±n/a nM
Citation
 Rouhana, JHoh, FEstaran, SHenriquet, CBoublik, YKerkour, ATrouillard, RMartinez, JPugnière, MPadilla, AChavanieu, A Fragment-based identification of a locus in the Sec7 domain of Arno for the design of protein-protein interaction inhibitors. J Med Chem 56:8497-511 (2013)  
Target
Name:
Cytohesin-2
Synonyms:
ARF exchange factor ARNO CYTH2 PSCD2 Protein ARNO
Type:
PROTEIN
Mol. Mass.:
46539.02
Organism:
Homo sapiens (Human)
Description:
ChEMBL_102649
Residue:
400
  
Inhibitor
Name:
BDBM50441973
Synonyms:
CHEMBL2440218
Type:
Small organic molecule
Emp. Form.:
C15H17NO4S
Mol. Mass.:
307.365
SMILES:
COc1ccc(cc1)S(=O)(=O)Nc1c(C)cc(O)cc1C
: