Target
Aurora kinase B
Ligand
BDBM50442159
Substrate
Meas. Tech.
ChEMBL_993110 (CHEMBL2446685)
Ki
>19953±n/a nM
Citation
 Alder, CMAmbler, MCampbell, AJChampigny, ACDeakin, AMHarling, JDHarris, CALongstaff, TLynn, SMaxwell, ACMooney, CJScullion, CSingh, OMSmith, IESomers, DOTame, CJWayne, GWilson, CWoolven, JM Identification of a Novel and Selective Series of Itk Inhibitors via a Template-Hopping Strategy. ACS Med Chem Lett 4:948-52 (2013)  
Target
Name:
Aurora kinase B
Synonyms:
AIK2 AIM1 ARK2 AURKB_HUMAN Aurora B-INCENP Aurora kinase B (AURKB) STK-1 STK12 Serine/threonine-protein kinase aurora B
Type:
Protein
Mol. Mass.:
39327.72
Organism:
Homo sapiens (Human)
Description:
Q96GD4
Residue:
344
  
Inhibitor
Name:
BDBM50442159
Synonyms:
CHEMBL2441285
Type:
Small organic molecule
Emp. Form.:
C24H23F3N6O2S
Mol. Mass.:
516.539
SMILES:
COc1ccc2nc(Nc3cc(nc(N[C@H]4CC[C@H](O)CC4)n3)C(F)(F)c3ccc(F)cc3)sc2n1
: