Target
Interferon-induced, double-stranded RNA-activated protein kinase
Ligand
BDBM50442162
Substrate
Meas. Tech.
ChEMBL_993289 (CHEMBL2443946)
IC50
359±n/a nM
Citation
 Axten, JMRomeril, SPShu, ARalph, JMedina, JRFeng, YLi, WHGrant, SWHeerding, DAMinthorn, EMencken, TGaul, NGoetz, AStanley, THassell, AMGampe, RTAtkins, CKumar, R Discovery of GSK2656157: An Optimized PERK Inhibitor Selected for Preclinical Development. ACS Med Chem Lett 4:964-8 (2013)  
Target
Name:
Interferon-induced, double-stranded RNA-activated protein kinase
Synonyms:
E2AK2_HUMAN Eukaryotic translation initiation factor 2-alpha kinase 2 P1/eIF-2A protein kinase PRKR Protein kinase RNA-activated eIF-2A protein kinase 2 | p68 kinase
Type:
PROTEIN
Mol. Mass.:
62104.61
Organism:
Homo sapiens (Human)
Description:
ChEMBL_1467743
Residue:
551
  
Inhibitor
Name:
BDBM50442162
Synonyms:
CHEMBL2441342
Type:
Small organic molecule
Emp. Form.:
C23H18F4N6O
Mol. Mass.:
470.4222
SMILES:
Cn1cc(-c2ccc3N(CCc3c2F)C(=O)Cc2cccc(n2)C(F)(F)F)c2c(N)ncnc12
: