Target
Bacterial leucyl aminopeptidase
Ligand
BDBM50442436
Substrate
Meas. Tech.
ChEMBL_989563 (CHEMBL2444619)
Ki
4000±n/a nM
Citation
 Al-Lakkis-Wehbe, MChaillou, BDefoin, AAlbrecht, STarnus, C Synthesis of amino-hydroxy-benzocycloheptenones as potent, selective, non-peptidic dinuclear zinc metalloaminopeptidase inhibitors. Bioorg Med Chem 21:6447-55 (2013)  
Target
Name:
Bacterial leucyl aminopeptidase
Synonyms:
AMPX_VIBPR | Bacterial leucyl aminopeptidase precursor
Type:
PROTEIN
Mol. Mass.:
54213.72
Organism:
Vibrio proteolyticus
Description:
ChEMBL_1507540
Residue:
504
  
Inhibitor
Name:
BDBM50442436
Synonyms:
CHEMBL2443109
Type:
Small organic molecule
Emp. Form.:
C11H13NO2
Mol. Mass.:
191.2264
SMILES:
N[C@H]1Cc2ccccc2C[C@@H](O)C1=O
: