Target
Egl nine homolog 1
Ligand
BDBM50442446
Substrate
Meas. Tech.
ChEMBL_989568 (CHEMBL2444624)
IC50
631±n/a nM
Citation
 Deng, GZhao, BMa, YXu, QWang, HYang, LZhang, QGuo, TBZhang, WJiao, YCai, XZhang, JLiu, HGuan, XLu, HXiang, JElliott, JDLin, XRen, F Novel complex crystal structure of prolyl hydroxylase domain-containing protein 2 (PHD2): 2,8-Diazaspiro[4.5]decan-1-ones as potent, orally bioavailable PHD2 inhibitors. Bioorg Med Chem 21:6349-58 (2013)  
Target
Name:
Egl nine homolog 1
Synonyms:
C1orf12 EGLN1_HUMAN Hypoxia-inducible factor prolyl hydroxylase 2 (HIF-PH2) Prolyl hydroxylase domain-containing protein 2 (PHD2)
Type:
Protein
Mol. Mass.:
46035.59
Organism:
Homo sapiens (Human)
Description:
Q9GZT9
Residue:
426
  
Inhibitor
Name:
BDBM50442446
Synonyms:
CHEMBL2443220
Type:
Small organic molecule
Emp. Form.:
C27H29N3O2
Mol. Mass.:
427.5381
SMILES:
COc1cccnc1CN1CCC2(CCN(C2=O)c2ccc(cc2)-c2ccccc2)CC1
: