Target
Egl nine homolog 1
Ligand
BDBM50442449
Substrate
Meas. Tech.
ChEMBL_989568 (CHEMBL2444624)
IC50
158±n/a nM
Citation
 Deng, GZhao, BMa, YXu, QWang, HYang, LZhang, QGuo, TBZhang, WJiao, YCai, XZhang, JLiu, HGuan, XLu, HXiang, JElliott, JDLin, XRen, F Novel complex crystal structure of prolyl hydroxylase domain-containing protein 2 (PHD2): 2,8-Diazaspiro[4.5]decan-1-ones as potent, orally bioavailable PHD2 inhibitors. Bioorg Med Chem 21:6349-58 (2013)  
Target
Name:
Egl nine homolog 1
Synonyms:
C1orf12 EGLN1_HUMAN Hypoxia-inducible factor prolyl hydroxylase 2 (HIF-PH2) Prolyl hydroxylase domain-containing protein 2 (PHD2)
Type:
Protein
Mol. Mass.:
46035.59
Organism:
Homo sapiens (Human)
Description:
Q9GZT9
Residue:
426
  
Inhibitor
Name:
BDBM50442449
Synonyms:
CHEMBL2443217
Type:
Small organic molecule
Emp. Form.:
C26H27N3O
Mol. Mass.:
397.5121
SMILES:
O=C1N(CCC11CCN(Cc2ccccn2)CC1)c1ccc(cc1)-c1ccccc1
: