Target
Sodium/glucose cotransporter 1
Ligand
BDBM50442488
Substrate
Meas. Tech.
ChEMBL_990144 (CHEMBL2444339)
EC50
24000±n/a nM
Citation
 Lin, TSLiw, YWSong, JSHsieh, TCYeh, HWHsu, LCLin, CJWu, SHLiang, PH Synthesis and biological evaluation of novel C-aryl d-glucofuranosides as sodium-dependent glucose co-transporter 2 inhibitors. Bioorg Med Chem 21:6282-91 (2013)  
Target
Name:
Sodium/glucose cotransporter 1
Synonyms:
High affinity sodium-glucose cotransporter Na(+)/glucose cotransporter 1 SGLT1 Sodium-dependent glucose cotransporter 1 (SGLT1) Sodium/glucose cotransporter 1 (SGLT1) | Solute carrier family 5 member 1
Type:
Protein
Mol. Mass.:
73503.78
Organism:
Homo sapiens (Human)
Description:
P13866
Residue:
664
  
Inhibitor
Name:
BDBM50442488
Synonyms:
CHEMBL2440374
Type:
Small organic molecule
Emp. Form.:
C23H29ClO5
Mol. Mass.:
420.926
SMILES:
CC(C)(C)c1ccc(Cc2cc(ccc2Cl)[C@@H]2O[C@H]([C@H](O)CO)[C@H](O)[C@H]2O)cc1
: