Target
Neuropeptide Y receptor type 5
Ligand
BDBM50442543
Substrate
Meas. Tech.
ChEMBL_990500 (CHEMBL2446797)
Ki
>5000±n/a nM
Citation
 Keller, MKaske, MHolzammer, TBernhardt, GBuschauer, A Dimeric argininamide-type neuropeptide Y receptor antagonists: chiral discrimination between Y1 and Y4 receptors. Bioorg Med Chem 21:6303-22 (2013)  
Target
Name:
Neuropeptide Y receptor type 5
Synonyms:
NPY-Y5 NPY5-R NPY5R_HUMAN NPYY5 Neuropeptide Y receptor type 5 ( NPY Y5) | Y5 receptor
Type:
Enzyme
Mol. Mass.:
50746.64
Organism:
Homo sapiens (Human)
Description:
Q15761
Residue:
445
  
Inhibitor
Name:
BDBM50442543
Synonyms:
CHEMBL2440914
Type:
Small organic molecule
Emp. Form.:
C90H112N18O16
Mol. Mass.:
1701.9633
SMILES:
NCCN(CCNC(=O)c1ccc(cc1)C(=O)NCCOCCOCCNC(=O)NC(=N)NCCC[C@@H](NC(=O)C(c1ccccc1)c1ccccc1)C(=O)NCc1ccc(O)cc1)CCNC(=O)c1ccc(cc1)C(=O)NCCOCCOCCNC(=O)NC(=N)NCCC[C@@H](NC(=O)C(c1ccccc1)c1ccccc1)C(=O)NCc1ccc(O)cc1
: