Target
Serine/threonine-protein kinase pim-1
Ligand
BDBM50442698
Substrate
Meas. Tech.
ChEMBL_989150 (CHEMBL2446213)
IC50
7.0±n/a nM
Citation
 Dwyer, MPKeertikar, KParuch, KAlvarez, CLabroli, MPoker, CFischmann, TOMayer-Ezell, RBond, RWang, YAzevedo, RGuzi, TJ Discovery of pyrazolo[1,5-a]pyrimidine-based Pim inhibitors: a template-based approach. Bioorg Med Chem Lett 23:6178-82 (2013)  
Target
Name:
Serine/threonine-protein kinase pim-1
Synonyms:
PIM-1 Kinase PIM1_HUMAN Serine/threonine-protein kinase (PIM1) Serine/threonine-protein kinase PIM1 | Serine/threonine-protein kinase pim-1 (PIM1)
Type:
Protein
Mol. Mass.:
35681.82
Organism:
Homo sapiens (Human)
Description:
P11309
Residue:
313
  
Inhibitor
Name:
BDBM50442698
Synonyms:
CHEMBL2442287
Type:
Small organic molecule
Emp. Form.:
C13H17N7
Mol. Mass.:
271.321
SMILES:
CN(C)CCNc1ccn2ncc(-c3cn[nH]c3)c2n1
: