Target
Integrin alpha-V/beta-3
Ligand
BDBM50442741
Substrate
Meas. Tech.
ChEMBL_989343 (CHEMBL2447562)
IC50
11±n/a nM
Citation
 Monaco, AZoete, VAlghisi, GCRüegg, CMichelin, OPrior, JScapozza, LSeimbille, Y Synthesis and in vitro evaluation of a novel radioligand foravß3 integrin receptor imaging: [18F]FPPA-c(RGDfK). Bioorg Med Chem Lett 23:6068-72 (2013)  
Target
Name:
Integrin alpha-V/beta-3
Synonyms:
ITGAV/ITGB3 | Integrin beta-3/Vitronectin receptor alpha
Type:
Enzyme
Mol. Mass.:
Description:
Components:
This complex has 2 components.
Component 1
Name:
Integrin alpha-V
Synonyms:
ITAV_HUMAN Integrin alpha-V/alpha-5 VNRA Vitronectin receptor | Vitronectin receptor subunit alpha
Type:
PROTEIN
Mol. Mass.:
116024.92
Organism:
Homo sapiens (Human)
Description:
ChEMBL_582336
Residue:
1048
  
Component 2
Name:
Integrin beta-3
Synonyms:
CD_antigen=CD61 GPIIIa ITGB3 Platelet membrane glycoprotein IIIa
Type:
Protein
Mol. Mass.:
87038.91
Organism:
Homo sapiens (Human)
Description:
P05106
Residue:
788
  
Inhibitor
Name:
BDBM50442741
Synonyms:
CHEMBL2442993
Type:
Small organic molecule
Emp. Form.:
C38H49FN12O8
Mol. Mass.:
820.8697
SMILES:
[#7]\[#6](-[#7])=[#7]/[#6]-[#6]-[#6]-[#6@@H]-1-[#7]-[#6](=O)-[#6@H](-[#6]-[#6]-[#6]-[#6]-n2cc(-[#6]-[#6]-[#6](=O)-[#7]-c3ccc(F)cc3)nn2)-[#7]-[#6](=O)-[#6@@H](-[#6]-c2ccccc2)-[#7]-[#6](=O)-[#6@H](-[#6]-[#6](-[#8])=O)-[#7]-[#6](=O)-[#6]-[#7]-[#6]-1=O
: