Target
D(2) dopamine receptor
Ligand
BDBM50442756
Substrate
Meas. Tech.
ChEMBL_989368 (CHEMBL2443403)
Ki
3400±n/a nM
Citation
 Banerjee, AMaschauer, SHübner, HGmeiner, PPrante, O Click chemistry based synthesis of dopamine D4 selective receptor ligands for the selection of potential PET tracers. Bioorg Med Chem Lett 23:6079-82 (2013)  
Target
Name:
D(2) dopamine receptor
Synonyms:
D(2) dopamine receptor DOPAMINE D2 Long DRD2 Dopamine D2 receptor Dopamine D2 receptor (D2R) Dopamine2-like | d2
Type:
Cell-surface receptors
Mol. Mass.:
50647.10
Organism:
Homo sapiens (Human)
Description:
P14416
Residue:
443
  
Inhibitor
Name:
BDBM50442756
Synonyms:
CHEMBL2443000
Type:
Small organic molecule
Emp. Form.:
C20H30FN5O3
Mol. Mass.:
407.4823
SMILES:
COc1ccccc1N1CCN(Cc2cn(CCOCCOCCF)nn2)CC1
: