Target
Heat shock cognate 71 kDa protein
Ligand
BDBM50442758
Substrate
Meas. Tech.
ChEMBL_989496 (CHEMBL2444023)
IC50
>10.0±n/a nM
Citation
 Brasca, MGMantegani, SAmboldi, NBindi, SCaronni, DCasale, ECeccarelli, WColombo, NDe Ponti, ADonati, DErmoli, AFachin, GFelder, ERFerguson, RDFiorelli, CGuanci, MIsacchi, APesenti, EPolucci, PRiceputi, LSola, FVisco, CZuccotto, FFogliatto, G Discovery of NMS-E973 as novel, selective and potent inhibitor of heat shock protein 90 (Hsp90). Bioorg Med Chem 21:7047-63 (2013)  
Target
Name:
Heat shock cognate 71 kDa protein
Synonyms:
HSC70 HSP7C_HUMAN HSPA8 heat shock 70kDa protein 8 isoform 2
Type:
Enzyme Catalytic Domain
Mol. Mass.:
70887.67
Organism:
Homo sapiens (Human)
Description:
gi_5729877
Residue:
646
  
Inhibitor
Name:
BDBM50442758
Synonyms:
CHEMBL2443139
Type:
Small organic molecule
Emp. Form.:
C25H30N4O5
Mol. Mass.:
466.5295
SMILES:
CC(C)Nc1ccc(Oc2cc(O)cc(O)c2-c2cc(no2)C(=O)NC2CCN(C)CC2)cc1
: