Target
Neuronal acetylcholine receptor subunit alpha-4/beta-2
Ligand
BDBM50166908
Substrate
Meas. Tech.
ChEMBL_1276115 (CHEMBL3089196)
Ki
0.130000±n/a nM
Citation
 Yenugonda, VMXiao, YLevin, EDRezvani, AHTran, TAl-Muhtasib, NSahibzada, NXie, TWells, CSlade, SJohnson, JEDakshanamurthy, SKong, HSTomita, YLiu, YPaige, MKellar, KJBrown, ML Design, synthesis and discovery of picomolar selective α4β2 nicotinic acetylcholine receptor ligands. J Med Chem 56:8404-21 (2013)  
Target
Name:
Neuronal acetylcholine receptor subunit alpha-4/beta-2
Synonyms:
Neuronal acetylcholine receptor Alpha-4/Beta-2 Neuronal acetylcholine receptor; alpha4/beta2 | nAChR subtypes alpha4 beta2
Type:
Protein
Mol. Mass.:
Description:
Components:
This complex has 2 components.
Component 1
Name:
Neuronal acetylcholine receptor subunit alpha-4
Synonyms:
ACHA4_HUMAN CHRNA4 protein Neuronal acetylcholine receptor protein alpha-4 subunit Nicotinic acetylcholine receptor alpha4/beta2/alpha5
Type:
Mol. Mass.:
69963.49
Organism:
Homo sapiens (Human)
Description:
NACHRA4
Residue:
627
  
Component 2
Name:
Neuronal acetylcholine receptor subunit beta-2
Synonyms:
ACHB2_HUMAN Neuronal acetylcholine receptor protein beta-2 subunit | Nicotinic acetylcholine receptor alpha3/beta2/alpha5
Type:
Protein
Mol. Mass.:
57020.50
Organism:
Homo sapiens (Human)
Description:
P17787
Residue:
502
  
Inhibitor
Name:
BDBM50166908
Synonyms:
5,8,14-triazatetracyclo[10.3.1.02,11.04,9]hexadeca-2(11),3,5,7,9-pentaene; dihydrochloride US9993465, Varenicline | VARENICLINE
Type:
Small organic molecule
Emp. Form.:
C13H13N3
Mol. Mass.:
211.2624
SMILES:
C1C2CNCC1c1cc3nccnc3cc21
: