Target
Acetylcholinesterase
Ligand
BDBM50443032
Substrate
Meas. Tech.
ChEMBL_1275665 (CHEMBL3090836)
IC50
>700000±n/a nM
Citation
 Andersson, CDForsgren, NAkfur, CAllgardsson, ABerg, LEngdahl, CQian, WEkström, FLinusson, A Divergent structure-activity relationships of structurally similar acetylcholinesterase inhibitors. J Med Chem 56:7615-24 (2013)  
Target
Name:
Acetylcholinesterase
Synonyms:
ACES_MOUSE Acetylcholinesterase (mouse AChE) Ache
Type:
Enzyme
Mol. Mass.:
68165.65
Organism:
Mus musculus (mouse)
Description:
Residue:
614
  
Inhibitor
Name:
BDBM50443032
Synonyms:
CHEMBL3087803
Type:
Small organic molecule
Emp. Form.:
C18H23ClN2O2S
Mol. Mass.:
366.905
SMILES:
CCN(CC)CCNS(=O)(=O)c1ccc(cc1)-c1ccc(Cl)cc1
: