Target
Cytochrome P450 2C9
Ligand
BDBM50443365
Substrate
Meas. Tech.
ChEMBL_1275556 (CHEMBL3090621)
IC50
12000±n/a nM
Citation
 Aoki, THyohdoh, IFuruichi, NOzawa, SWatanabe, FMatsushita, MSakaitani, MOri, KTakanashi, KHarada, NTomii, YTabo, MYoshinari, KAoki, YShimma, NIikura, H The sulfamide moiety affords higher inhibitory activity and oral bioavailability to a series of coumarin dual selective RAF/MEK inhibitors. Bioorg Med Chem Lett 23:6223-7 (2013)  
Target
Name:
Cytochrome P450 2C9
Synonyms:
(R)-limonene 6-monooxygenase CP2C9_HUMAN CYP2C9 Cytochrome P450 2C9 (CYP2C9 ) P-450MP P450 PB-1 | S-mephenytoin 4-hydroxylase
Type:
Enzyme
Mol. Mass.:
55636.33
Organism:
Homo sapiens (Human)
Description:
P11712
Residue:
490
  
Inhibitor
Name:
BDBM50443365
Synonyms:
CHEMBL3086078
Type:
Small organic molecule
Emp. Form.:
C20H19F2N3O6S
Mol. Mass.:
467.443
SMILES:
CN(C)C(=O)Oc1cc2oc(=O)c(Cc3cccc(NS(N)(=O)=O)c3F)c(C)c2cc1F
: