Target
Cyclin-T1/Cyclin-dependent kinase 9
Ligand
BDBM50443449
Substrate
Meas. Tech.
ChEMBL_1274643 (CHEMBL3089979)
Ki
3.0±n/a nM
Citation
 Shao, HShi, SFoley, DWLam, FAbbas, AYLiu, XHuang, SJiang, XBaharin, NFischer, PMWang, S Synthesis, structure-activity relationship and biological evaluation of 2,4,5-trisubstituted pyrimidine CDK inhibitors as potential anti-tumour agents. Eur J Med Chem 70:447-55 (2013)  
Target
Name:
Cyclin-T1/Cyclin-dependent kinase 9
Synonyms:
CDK9/ Cyclin-T1 CDK9/Cyclin T Cyclin T1/dependent kinase 9 | Cyclin-Dependent Kinase 9 (CDK9)
Type:
Protein Complex
Mol. Mass.:
Description:
Components:
This complex has 2 components.
Component 1
Name:
Cyclin-T1
Synonyms:
CCNT1 CycT Cyclin T Cyclin-T
Type:
Enzyme Subunit
Mol. Mass.:
80712.40
Organism:
Homo sapiens (Human)
Description:
Residue:
726
  
Component 2
Name:
Cyclin-dependent kinase 9
Synonyms:
C-2K CDK9 Cell division cycle 2-like protein kinase 4 Cyclin-Dependent Kinase 9 (CDK9) Serine/threonine-protein kinase PITALRE Tat-associated kinase complex catalytic subunit
Type:
Enzyme Subunit
Mol. Mass.:
42789.13
Organism:
Homo sapiens (Human)
Description:
Residue:
372
  
Inhibitor
Name:
BDBM50443449
Synonyms:
CHEMBL3087442
Type:
Small organic molecule
Emp. Form.:
C18H21FN6O3S2
Mol. Mass.:
452.526
SMILES:
CNc1nc(C)c(s1)-c1nc(Nc2cccc(c2)S(=O)(=O)NCCOC)ncc1F
: