Target
Urease
Ligand
BDBM50099857
Substrate
Meas. Tech.
ChEMBL_1274834 (CHEMBL3090408)
IC50
41500±n/a nM
Citation
 Rauf, MKTalib, ABadshah, AZaib, SShoaib, KShahid, MFlörke, UImtiaz-ud-Din, naIqbal, J Solution-phase microwave assisted parallel synthesis of N,N'-disubstituted thioureas derived from benzoic acid: biological evaluation and molecular docking studies. Eur J Med Chem 70:487-96 (2013)  
Target
Name:
Urease
Synonyms:
UREA_CANEN | Urea amidohydrolase
Type:
Enzyme
Mol. Mass.:
90746.20
Organism:
Canavalia ensiformis (Jack bean) (Horse bean)
Description:
P07374
Residue:
840
  
Inhibitor
Name:
BDBM50099857
Synonyms:
ACETOHYDROXAMIC ACID (AHA) Acethydroxamsaeure Acetic acid, oxime Cetohyroxamic acid Methylhydroxamic acid N-Acetylhydroxylamine acetohydroxamic acid
Type:
Small organic molecule
Emp. Form.:
C2H5NO2
Mol. Mass.:
75.0666
SMILES:
CC(=O)NO
: