Target
Dual specificity tyrosine-phosphorylation-regulated kinase 1B
Ligand
BDBM50443638
Substrate
Meas. Tech.
ChEMBL_1280765 (CHEMBL3097749)
IC50
72±n/a nM
Citation
 Burgy, GTahtouh, TDurieu, EFoll-Josselin, BLimanton, EMeijer, LCarreaux, FBazureau, JP Chemical synthesis and biological validation of immobilized protein kinase inhibitory Leucettines. Eur J Med Chem 62:728-37 (2013)  
Target
Name:
Dual specificity tyrosine-phosphorylation-regulated kinase 1B
Synonyms:
DYR1B_HUMAN Dual specificity tyrosine-phosphorylation-regulated kinase 1B MIRK
Type:
Enzyme
Mol. Mass.:
69222.24
Organism:
Homo sapiens (Human)
Description:
Q9Y463
Residue:
629
  
Inhibitor
Name:
BDBM50443638
Synonyms:
CHEMBL3092863
Type:
Small organic molecule
Emp. Form.:
C25H30N4O7
Mol. Mass.:
498.5283
SMILES:
NCCOCCOCCOCCOc1ccc(NC2=NC(=Cc3ccc4OCOc4c3)C(=O)N2)cc1
: