Target
Cell division cycle 7-related protein kinase/Protein DBF4 homolog A
Ligand
BDBM50443645
Substrate
Meas. Tech.
ChEMBL_1277972 (CHEMBL3095010)
IC50
3.9±n/a nM
Citation
 Harrington, PEBourbeau, MPFotsch, CFrohn, MPickrell, AJReichelt, ASham, KSiegmund, ACBailis, JMBush, TEscobar, SHickman, DHeller, SHsieh, FOrf, JNRong, MSan Miguel, TTan, HZalameda, LAllen, JG The optimization of aminooxadiazoles as orally active inhibitors of Cdc7. Bioorg Med Chem Lett 23:6396-400 (2013)  
Target
Name:
Cell division cycle 7-related protein kinase/Protein DBF4 homolog A
Synonyms:
Activator of S phase kinase DBF4/Cell division cycle 7-related protein kinase CDC7/DBF4 (Cell division cycle 7-related protein kinase/Activator of S phase kinase)
Type:
Protein
Mol. Mass.:
Description:
Components:
This complex has 2 components.
Component 1
Name:
Protein DBF4 homolog A
Synonyms:
ASK Chiffon homolog A DBF4-type zinc finger-containing protein 1 DBF4A_HUMAN ZDBF1
Type:
Regulatory subunit
Mol. Mass.:
76869.65
Organism:
Homo sapiens (Human)
Description:
Residue:
674
  
Component 2
Name:
Cell division cycle 7-related protein kinase
Synonyms:
CDC7 CDC7L1 Cell division cycle 7-related protein kinase (CDC7) huCdc7
Type:
Protein
Mol. Mass.:
63908.16
Organism:
Homo sapiens (Human)
Description:
O00311
Residue:
574
  
Inhibitor
Name:
BDBM50443645
Synonyms:
CHEMBL3093079
Type:
Small organic molecule
Emp. Form.:
C18H14F2N6O
Mol. Mass.:
368.3402
SMILES:
Fc1ccc2c(c[nH]c2n1)-c1nnc(N[C@H](C2CC2)c2cccnc2F)o1
: