Target
Cholinesterase
Ligand
BDBM50443686
Substrate
Meas. Tech.
ChEMBL_1278503 (CHEMBL3094810)
IC50
24±n/a nM
Citation
 Sun, YChen, JChen, XHuang, LLi, X Inhibition of cholinesterase and monoamine oxidase-B activity by Tacrine-Homoisoflavonoid hybrids. Bioorg Med Chem 21:7406-17 (2013)  
Target
Name:
Cholinesterase
Synonyms:
BCHE CHLE_HORSE | Cholinesterase
Type:
Enzyme
Mol. Mass.:
65643.35
Organism:
Equus caballus (Horse)
Description:
P81908
Residue:
574
  
Inhibitor
Name:
BDBM50443686
Synonyms:
CHEMBL3093173
Type:
Small organic molecule
Emp. Form.:
C35H36N2O4
Mol. Mass.:
548.6713
SMILES:
COc1ccc(\C=C2/COc3cc(OCCCCCNc4c5CCCCc5nc5ccccc45)ccc3C2=O)cc1
: