Target
Acyl-CoA desaturase 1
Ligand
BDBM50443716
Substrate
Meas. Tech.
ChEMBL_1279690 (CHEMBL3094880)
IC50
8.0±n/a nM
Citation
 Yang, SMTang, YZhang, RLu, HKuo, GHGaul, MDLi, YHo, GConway, JGLiang, YLenhard, JMDemarest, KTMurray, WV 4-Bicyclic heteroaryl-piperidine derivatives as potent, orally bioavailable Stearoyl-CoA desaturase-1 (SCD1) inhibitors. Part 1: urea-based analogs. Bioorg Med Chem Lett 23:6773-6 (2013)  
Target
Name:
Acyl-CoA desaturase 1
Synonyms:
ACOD1_RAT Scd Stearoyl-CoA desaturase 1 (SCD1)
Type:
Enzyme
Mol. Mass.:
41485.97
Organism:
Rattus norvegicus (Rat)
Description:
P07308
Residue:
358
  
Inhibitor
Name:
BDBM50443716
Synonyms:
CHEMBL3093874 | US9238658, 50
Type:
Small organic molecule
Emp. Form.:
C19H23FN4O2S
Mol. Mass.:
390.475
SMILES:
OCCc1cnc(NC(=O)N2CCC(CC2)N2CCc3ccc(F)cc23)s1
: