Target
Sonic hedgehog protein
Ligand
BDBM50443902
Substrate
Meas. Tech.
ChEMBL_1277855 (CHEMBL3097789)
IC50
1.2±n/a nM
Citation
 Xin, MWen, JTang, FTu, CShen, HZhao, X The discovery of novel N-(2-pyrimidinylamino) benzamide derivatives as potent hedgehog signaling pathway inhibitors. Bioorg Med Chem Lett 23:6777-83 (2013)  
Target
Name:
Sonic hedgehog protein
Synonyms:
Hhg1 Shh
Type:
Protein
Mol. Mass.:
47784.50
Organism:
Mus musculus (Mouse)
Description:
Q62226
Residue:
437
  
Inhibitor
Name:
BDBM50443902
Synonyms:
CHEMBL3091566
Type:
Small organic molecule
Emp. Form.:
C30H25F3N6O2
Mol. Mass.:
558.5537
SMILES:
Cc1ccc(cc1NC(=O)c1ccc(Nc2ncc(C)c(n2)-c2ccc(OC(F)(F)F)cc2)cc1)-c1cnn(C)c1
: