Target
Alkaline phosphatase, placental type
Ligand
BDBM50241179
Substrate
Meas. Tech.
ChEMBL_1278526 (CHEMBL3095033)
IC50
>400000±n/a nM
Citation
 Debray, JChang, LMarquès, SPellet-Rostaing, SLe Duy, DMebarek, SBuchet, RMagne, DPopowycz, FLemaire, M Inhibitors of tissue-nonspecific alkaline phosphatase: design, synthesis, kinetics, biomineralization and cellular tests. Bioorg Med Chem 21:7981-7 (2013)  
Target
Name:
Alkaline phosphatase, placental type
Synonyms:
ALPP PLAP | PPB1_HUMAN
Type:
PROTEIN
Mol. Mass.:
57950.65
Organism:
Homo sapiens (Human)
Description:
ChEMBL_1506090
Residue:
535
  
Inhibitor
Name:
BDBM50241179
Synonyms:
(S)-6-phenyl-2,3,5,6-tetrahydroimidazo[2,1-b]thiazole 6-Phenyl-2,3,5,6-tetrahydro-imidazo[2,1-b]thiazole (Levamisole) 6-Phenyl-2,3,5,6-tetrahydro-imidazo[2,1-b]thiazole(tetramisole) LEVAMISOLE TCMDC-125847 levamisole;6-Phenyl-2,3,5,6-tetrahydro-imidazo[2,1-b]thiazole | tetramisole;6-Phenyl-2,3,5,6-tetrahydro-imidazo[2,1-b]thiazole
Type:
Small organic molecule
Emp. Form.:
C11H12N2S
Mol. Mass.:
204.291
SMILES:
C1CN2C[C@@H](N=C2S1)c1ccccc1
: