Target
Broad substrate specificity ATP-binding cassette transporter ABCG2
Ligand
BDBM3264
Substrate
Meas. Tech.
ChEMBL_1278746 (CHEMBL3096293)
IC50
1080±n/a nM
Citation
 Juvale, KGallus, JWiese, M Investigation of quinazolines as inhibitors of breast cancer resistance protein (ABCG2). Bioorg Med Chem 21:7858-73 (2013)  
Target
Name:
Broad substrate specificity ATP-binding cassette transporter ABCG2
Synonyms:
ABCG2 ABCP ATP-binding cassette sub-family G member 2 ATP-binding cassette, sub-family G, member 2 BCRP1 CDw338 Mitoxantrone resistance-associated protein Urate exporter
Type:
Multi-pass membrane protein; monomer or homodimer; disulfide-linked
Mol. Mass.:
72329.48
Organism:
Homo sapiens (Human)
Description:
Q9UNQ0
Residue:
655
  
Inhibitor
Name:
BDBM3264
Synonyms:
4-Anilino quinazoline deriv. 15 N-(3-bromophenyl)quinazolin-4-amine
Type:
Small organic molecule
Emp. Form.:
C14H10BrN3
Mol. Mass.:
300.153
SMILES:
Brc1cccc(Nc2ncnc3ccccc23)c1
: