Target
Broad substrate specificity ATP-binding cassette transporter ABCG2
Ligand
BDBM50444005
Substrate
Meas. Tech.
ChEMBL_1278745 (CHEMBL3096292)
IC50
110±n/a nM
Citation
 Juvale, KGallus, JWiese, M Investigation of quinazolines as inhibitors of breast cancer resistance protein (ABCG2). Bioorg Med Chem 21:7858-73 (2013)  
Target
Name:
Broad substrate specificity ATP-binding cassette transporter ABCG2
Synonyms:
ABCG2 ABCP ATP-binding cassette sub-family G member 2 ATP-binding cassette, sub-family G, member 2 BCRP1 CDw338 Mitoxantrone resistance-associated protein Urate exporter
Type:
Multi-pass membrane protein; monomer or homodimer; disulfide-linked
Mol. Mass.:
72329.48
Organism:
Homo sapiens (Human)
Description:
Q9UNQ0
Residue:
655
  
Inhibitor
Name:
BDBM50444005
Synonyms:
CHEMBL3092490
Type:
Small organic molecule
Emp. Form.:
C22H19N3O3
Mol. Mass.:
373.4046
SMILES:
COc1ccc(cc1OC)-c1nc(Nc2cccc(O)c2)c2ccccc2n1
: