Target
Hepatocyte growth factor receptor
Ligand
BDBM50444215
Substrate
Meas. Tech.
ChEMBL_1277903 (CHEMBL3094553)
IC50
89±n/a nM
Citation
 Matsumoto, SMiyamoto, NHirayama, TOki, HOkada, KTawada, MIwata, HNakamura, KYamasaki, SMiki, HHori, AImamura, S Structure-based design, synthesis, and evaluation of imidazo[1,2-b]pyridazine and imidazo[1,2-a]pyridine derivatives as novel dual c-Met and VEGFR2 kinase inhibitors. Bioorg Med Chem 21:7686-98 (2013)  
Target
Name:
Hepatocyte growth factor receptor
Synonyms:
Hepatocyte growth factor receptor Hepatocyte growth factor receptor (c-MET) MET Met proto-oncogene (hepatocyte growth factor receptor) Tyrosine-protein kinase Met (c-Met) c-Met kinase
Type:
Protein
Mol. Mass.:
155559.73
Organism:
Homo sapiens (Human)
Description:
P08581
Residue:
1390
  
Inhibitor
Name:
BDBM50444215
Synonyms:
CHEMBL3093586
Type:
Small organic molecule
Emp. Form.:
C27H23N7O3
Mol. Mass.:
493.5166
SMILES:
Cc1cc(nn1-c1ccccc1)C(=O)Nc1ccc(Oc2ccc3nc(NC(=O)C4CC4)cn3n2)cc1
: