Target
Oxysterols receptor LXR-alpha
Ligand
BDBM19993
Substrate
Meas. Tech.
ChEMBL_1279569 (CHEMBL3097482)
EC50
373±n/a nM
Citation
 Fauber, BPde Leon Boenig, GBurton, BEidenschenk, CEverett, CGobbi, AHymowitz, SGJohnson, ARLiimatta, MLockey, PNorman, MOuyang, WRené, OWong, H Structure-based design of substituted hexafluoroisopropanol-arylsulfonamides as modulators of RORc. Bioorg Med Chem Lett 23:6604-9 (2013)  
Target
Name:
Oxysterols receptor LXR-alpha
Synonyms:
LXRA Liver X receptor alpha Liver X receptor alpha (NR1H3) NR1H3 Nuclear orphan receptor LXR-alpha | Nuclear receptor subfamily 1 group H member 3
Type:
Enzyme Catalytic Domain
Mol. Mass.:
50403.85
Organism:
Homo sapiens (Human)
Description:
Q13133
Residue:
447
  
Inhibitor
Name:
BDBM19993
Synonyms:
CHEMBL62136 T 0901317 TO-901317 US10669296, Compound TO901317 [3H]T0901317
Type:
Small organic molecule
Emp. Form.:
C17H12F9NO3S
Mol. Mass.:
481.333
SMILES:
OC(c1ccc(cc1)N(CC(F)(F)F)S(=O)(=O)c1ccccc1)(C(F)(F)F)C(F)(F)F
: