Target
Poly [ADP-ribose] polymerase tankyrase-2
Ligand
BDBM50068762
Substrate
Meas. Tech.
ChEMBL_1281548 (CHEMBL3102114)
IC50
12±n/a nM
Citation
 Nathubhai, AWood, PJLloyd, MDThompson, ASThreadgill, MD Design and Discovery of 2-Arylquinazolin-4-ones as Potent and Selective Inhibitors of Tankyrases. ACS Med Chem Lett 4:1173-7 (2013)  
Target
Name:
Poly [ADP-ribose] polymerase tankyrase-2
Synonyms:
(ARTD6 or PARP5b) Poly [ADP-ribose] polymerase tankyrase-2 TNKL TNKS2_HUMAN Tankyrase 2 Tankyrase-2 Tankyrase-2 (TNKS2)
Type:
Enzyme
Mol. Mass.:
126937.16
Organism:
Homo sapiens (Human)
Description:
Q9H2K2
Residue:
1166
  
Inhibitor
Name:
BDBM50068762
Synonyms:
2-(4-Methoxy-phenyl)-8-methyl-3H-quinazolin-4-one | CHEMBL127101
Type:
Small organic molecule
Emp. Form.:
C16H14N2O2
Mol. Mass.:
266.2946
SMILES:
COc1ccc(cc1)-c1nc2c(C)cccc2c(=O)[nH]1
: