Target
Poly [ADP-ribose] polymerase 1
Ligand
BDBM50444542
Substrate
Meas. Tech.
ChEMBL_1281547 (CHEMBL3102113)
IC50
>5000±n/a nM
Citation
 Nathubhai, AWood, PJLloyd, MDThompson, ASThreadgill, MD Design and Discovery of 2-Arylquinazolin-4-ones as Potent and Selective Inhibitors of Tankyrases. ACS Med Chem Lett 4:1173-7 (2013)  
Target
Name:
Poly [ADP-ribose] polymerase 1
Synonyms:
(ARTD1 or PARP1) 2.4.2.30 ADPRT ARTD1 Human diphtheria toxin-like ADP-ribosyltransferase (ARTD1 or PARP1) NT-PARP-1 PARP1 PPOL Poly [ADP-ribose] polymerase 1 (PARP) Poly [ADP-ribose] polymerase 1 (PARP1) Poly [ADP-ribose] polymerase 1, 28-kDa form Poly [ADP-ribose] polymerase 1, processed C-terminus Poly [ADP-ribose] polymerase-1 Poly(ADP-ribose) polymerase-1 (ARTD1/PARP1) Protein poly-ADP-ribosyltransferase PARP1 | Synonyms=ADPRT
Type:
Mol. Mass.:
113114.22
Organism:
Homo sapiens (Human)
Description:
P09874
Residue:
1014
  
Inhibitor
Name:
BDBM50444542
Synonyms:
CHEMBL3098938
Type:
Small organic molecule
Emp. Form.:
C15H11FN2O
Mol. Mass.:
254.259
SMILES:
Cc1cccc2c1nc([nH]c2=O)-c1ccc(F)cc1
: