Target
Orexin receptor type 2
Ligand
BDBM50444610
Substrate
Meas. Tech.
ChEMBL_1283184 (CHEMBL3101095)
Ki
0.800000±n/a nM
Citation
 Mercer, SPRoecker, AJGarson, SReiss, DRMeacham Harrell, CMurphy, KLBruno, JGBednar, RALemaire, WCui, DCabalu, TDTang, CPrueksaritanont, THartman, GDYoung, SDWinrow, CJRenger, JJColeman, PJ Discovery of 2,5-diarylnicotinamides as selective orexin-2 receptor antagonists (2-SORAs). Bioorg Med Chem Lett 23:6620-4 (2013)  
Target
Name:
Orexin receptor type 2
Synonyms:
HCRTR2 OX2R_HUMAN Orexin receptor type 2 (OR-2) Orexin receptor type 2 (OX2R) Ox-2-R | Ox2-R
Type:
Protein
Mol. Mass.:
50710.53
Organism:
Homo sapiens (Human)
Description:
O43614
Residue:
444
  
Inhibitor
Name:
BDBM50444610
Synonyms:
CHEMBL3099894
Type:
Small organic molecule
Emp. Form.:
C27H24FN3O3
Mol. Mass.:
457.4962
SMILES:
COc1ccc(CNC(=O)c2cc(cnc2-c2cccnc2)-c2cc(C)cc(F)c2)cc1OC
: