Target
Lethal factor
Ligand
BDBM50444728
Substrate
Meas. Tech.
ChEMBL_1281773 (CHEMBL3100542)
IC50
1101±n/a nM
Citation
 Williams, JDKhan, ARCardinale, SCButler, MMBowlin, TLPeet, NP Small molecule inhibitors of anthrax lethal factor toxin. Bioorg Med Chem 22:419-34 (2013)  
Target
Name:
Lethal factor
Synonyms:
Anthrax Lethal Factor (LF) Antrax lethal toxin lef | lethal factor
Type:
PROTEIN
Mol. Mass.:
93758.56
Organism:
Bacillus anthracis
Description:
ChEMBL_1460338
Residue:
809
  
Inhibitor
Name:
BDBM50444728
Synonyms:
CHEMBL3098990
Type:
Small organic molecule
Emp. Form.:
C20H21N3O2
Mol. Mass.:
335.3996
SMILES:
COc1ccccc1CCC(=O)Nc1ccc2nc(C)cc(N)c2c1
: