Target
Beta-2 adrenergic receptor
Ligand
BDBM50444836
Substrate
Meas. Tech.
ChEMBL_1282347 (CHEMBL3100398)
EC50
5.0±n/a nM
Citation
 Huang, LShan, WZhou, QXie, JLai, KLi, X Design, synthesis and evaluation of dual pharmacologyß2-adrenoceptor agonists and PDE4 inhibitors. Bioorg Med Chem Lett 24:249-53 (2013)  
Target
Name:
Beta-2 adrenergic receptor
Synonyms:
ADRB2_CAVPO adrenergic Beta2
Type:
Enzyme Catalytic Domain
Mol. Mass.:
46993.24
Organism:
GUINEA PIG
Description:
adrenergic Beta2 ADRB2 GUINEA PIG::Q8K4Z4
Residue:
418
  
Inhibitor
Name:
BDBM50444836
Synonyms:
CHEMBL3099248
Type:
Small organic molecule
Emp. Form.:
C40H52N4O7
Mol. Mass.:
700.8635
SMILES:
COc1ccc(cc1OC)C1=NN(CCCCCCOc2ccc(CC(C)NCC(O)c3ccc(O)c(NC=O)c3)cc2)C(=O)C2CCCCC12
: