Target
Retinoic acid receptor RXR-alpha
Ligand
BDBM50445060
Substrate
Meas. Tech.
ChEMBL_1282431 (CHEMBL3100732)
EC50
120±n/a nM
Citation
 Desphande, AXia, GBoerma, LJVines, KKAtigadda, VRLobo-Ruppert, SGrubbs, CJMoeinpour, FLSmith, CDChristov, KBrouillette, WJMuccio, DD Methyl-substituted conformationally constrained rexinoid agonists for the retinoid X receptors demonstrate improved efficacy for cancer therapy and prevention. Bioorg Med Chem 22:178-85 (2013)  
Target
Name:
Retinoic acid receptor RXR-alpha
Synonyms:
NR2B Channel Blocker RXRA_RAT Retinoid X receptor alpha | Rxra
Type:
Enzyme Catalytic Domain
Mol. Mass.:
51273.78
Organism:
RAT
Description:
NR2B Channel Blocker 0 RAT::Q05343
Residue:
467
  
Inhibitor
Name:
BDBM50445060
Synonyms:
CHEMBL3098773
Type:
Small organic molecule
Emp. Form.:
C21H24O2
Mol. Mass.:
308.4141
SMILES:
C[C@@H]1CC\C(=C/C(/C)=C\C=C\C(\C)=C\C(O)=O)c2ccccc12
: