Target
NUAK family SNF1-like kinase 1
Ligand
BDBM50445474
Substrate
Meas. Tech.
ChEMBL_1284307 (CHEMBL3108328)
IC50
3770±n/a nM
Citation
 El Amrani, MLai, DDebbab, AAly, AHSiems, KSeidel, CSchnekenburger, MGaigneaux, ADiederich, MFeger, DLin, WProksch, P Protein kinase and HDAC inhibitors from the endophytic fungus Epicoccum nigrum. J Nat Prod 77:49-56 (2014)  
Target
Name:
NUAK family SNF1-like kinase 1
Synonyms:
ARK5 NUAK1 OMPHK1
Type:
PROTEIN
Mol. Mass.:
74326.51
Organism:
Homo sapiens (Human)
Description:
ChEMBL_1451343
Residue:
661
  
Inhibitor
Name:
BDBM50445474
Synonyms:
CHEMBL3104855
Type:
Small organic molecule
Emp. Form.:
C18H14O8
Mol. Mass.:
358.299
SMILES:
Cc1c(O)c(O)c2oc(cc2c1C=O)-c1c(C)c(O)c(O)c(O)c1C=O
: