Target
NUAK family SNF1-like kinase 1
Ligand
BDBM50445475
Substrate
Meas. Tech.
ChEMBL_1284307 (CHEMBL3108328)
IC50
10000±n/a nM
Citation
 El Amrani, MLai, DDebbab, AAly, AHSiems, KSeidel, CSchnekenburger, MGaigneaux, ADiederich, MFeger, DLin, WProksch, P Protein kinase and HDAC inhibitors from the endophytic fungus Epicoccum nigrum. J Nat Prod 77:49-56 (2014)  
Target
Name:
NUAK family SNF1-like kinase 1
Synonyms:
ARK5 NUAK1 OMPHK1
Type:
PROTEIN
Mol. Mass.:
74326.51
Organism:
Homo sapiens (Human)
Description:
ChEMBL_1451343
Residue:
661
  
Inhibitor
Name:
BDBM50445475
Synonyms:
CHEMBL3104854
Type:
Small organic molecule
Emp. Form.:
C9H8O5
Mol. Mass.:
196.1568
SMILES:
Cc1c2COC(=O)c2c(O)c(O)c1O
: