Target
Histamine H2 receptor
Ligand
BDBM50445613
Substrate
Meas. Tech.
ChEMBL_1283829 (CHEMBL3106116)
Ki
5.7±n/a nM
Citation
 Rajagopalan, RBandyopadhyaya, ARajagopalan, DRRajagopalan, P The synthesis and comparative receptor binding affinities of novel, isomeric pyridoindolobenzazepine scaffolds. Bioorg Med Chem Lett 24:576-9 (2014)  
Target
Name:
Histamine H2 receptor
Synonyms:
Gastric receptor I HISTAMINE H2 HRH2_HUMAN Histamine H2-Gs alpha S
Type:
G Protein-Coupled Receptor (GPCR)
Mol. Mass.:
40115.31
Organism:
Homo sapiens (Human)
Description:
Residue:
359
  
Inhibitor
Name:
BDBM50445613
Synonyms:
Asenapine maleate ORG-5222 | Saphris
Type:
Small organic molecule
Emp. Form.:
C17H16ClNO
Mol. Mass.:
285.768
SMILES:
CN1C[C@@H]2[C@@H](C1)c1cc(Cl)ccc1Oc1ccccc21
: