Target
Neuropeptide Y receptor type 2
Ligand
BDBM50205093
Substrate
Meas. Tech.
ChEMBL_1283880 (CHEMBL3106331)
EC50
6.0±n/a nM
Citation
 Mittapalli, GKRoberts, E Ligands of the neuropeptide Y Y2 receptor. Bioorg Med Chem Lett 24:430-41 (2014)  
Target
Name:
Neuropeptide Y receptor type 2
Synonyms:
NPY-Y2 NPY2-R NPY2R_HUMAN Y2 receptor | neuropeptide Y receptor Y2
Type:
Enzyme Catalytic Domain
Mol. Mass.:
42734.65
Organism:
Homo sapiens (Human)
Description:
NPY-Y2 NPY2R HUMAN::P49146
Residue:
381
  
Inhibitor
Name:
BDBM50205093
Synonyms:
CHEMBL428017 | LRHYLNLLTRQRY-NH2
Type:
Small organic molecule
Emp. Form.:
C81H131N27O19
Mol. Mass.:
1787.0763
SMILES:
CC(C)C[C@H](NC(C)=O)C(=O)N[C@@H](CCCN=C(N)N)C(=O)N[C@@H](Cc1cnc[nH]1)C(=O)N[C@@H](Cc1ccc(O)cc1)C(=O)N[C@@H](CC(C)C)C(=O)N[C@@H](CC(N)=O)C(=O)N[C@@H](CC(C)C)C(=O)N[C@@H](CC(C)C)C(=O)N[C@@H]([C@@H](C)O)C(=O)N[C@@H](CCCN=C(N)N)C(=O)N[C@@H](CCC(N)=O)C(=O)N[C@@H](CCCN=C(N)N)C(=O)N[C@@H](Cc1ccc(O)cc1)C(N)=O
: