Target
Aldo-keto reductase family 1 member C3
Ligand
BDBM50446015
Substrate
Meas. Tech.
ChEMBL_1283742 (CHEMBL3108467)
IC50
13±n/a nM
Citation
 Flanagan, JUAtwell, GJHeinrich, DMBrooke, DGSilva, SRigoreau, LJTrivier, ETurnbull, APRaynham, TJamieson, SMDenny, WA Morpholylureas are a new class of potent and selective inhibitors of the type 5 17-ß-hydroxysteroid dehydrogenase (AKR1C3). Bioorg Med Chem 22:967-77 (2014)  
Target
Name:
Aldo-keto reductase family 1 member C3
Synonyms:
17-beta-Hydroxysteroid Dehydrogenase 5 (17-beta-HSD5, AKR1C3) AK1C3_HUMAN Aldo-keto reductase family 1 member C3 Aldo-keto reductase family 1 member C3 (AK1C3a) Aldo-keto-reductase family 1 member C3 Dihydrodiol dehydrogenase 3 Estradiol 17-beta-dehydrogenase KIAA0119 Prostaglandin F synthase Trans-1,2-dihydrobenzene-1,2-diol dehydrogenase
Type:
Enzyme
Mol. Mass.:
36859.86
Organism:
Homo sapiens (Human)
Description:
P42330
Residue:
323
  
Inhibitor
Name:
BDBM50446015
Synonyms:
CHEMBL3103331
Type:
Small organic molecule
Emp. Form.:
C16H22ClN3O2
Mol. Mass.:
323.818
SMILES:
Cc1cc(Cl)ccc1N1CCN(CC1)C(=O)N1CCOCC1
: