Target
Poly [ADP-ribose] polymerase 1
Ligand
BDBM50446130
Substrate
Meas. Tech.
ChEMBL_1288130 (CHEMBL3110590)
Ki
1.4±n/a nM
Citation
 Haikarainen, TNarwal, MJoensuu, PLehtiö, L Evaluation and Structural Basis for the Inhibition of Tankyrases by PARP Inhibitors. ACS Med Chem Lett 5:18-22 (2014)  
Target
Name:
Poly [ADP-ribose] polymerase 1
Synonyms:
(ARTD1 or PARP1) 2.4.2.30 ADPRT ARTD1 Human diphtheria toxin-like ADP-ribosyltransferase (ARTD1 or PARP1) NT-PARP-1 PARP1 PPOL Poly [ADP-ribose] polymerase 1 (PARP) Poly [ADP-ribose] polymerase 1 (PARP1) Poly [ADP-ribose] polymerase 1, 28-kDa form Poly [ADP-ribose] polymerase 1, processed C-terminus Poly [ADP-ribose] polymerase-1 Poly(ADP-ribose) polymerase-1 (ARTD1/PARP1) Protein poly-ADP-ribosyltransferase PARP1 | Synonyms=ADPRT
Type:
Mol. Mass.:
113114.22
Organism:
Homo sapiens (Human)
Description:
P09874
Residue:
1014
  
Inhibitor
Name:
BDBM50446130
Synonyms:
AG-014699 RUCAPARIB CAMSYLATE | Rucaparib
Type:
Small organic molecule
Emp. Form.:
C19H18FN3O
Mol. Mass.:
323.3641
SMILES:
CNCc1ccc(cc1)-c1[nH]c2cc(F)cc3C(=O)NCCc1c23
: